Avidemux Forum

Avidemux => Main version 2.6 => Topic started by: bernd_b on March 21, 2015, 07:03:36 PM

Title: compile errror
Post by: bernd_b on March 21, 2015, 07:03:36 PM
 I fail to compile todays git (git clone https://github.com/mean00/avidemux2.git). Here are the last lines from the logfile /tmp/logbuildCore


....
perl /mnt/sda7/ffmpeg_neu/avidemux_2.6/avidemux2/buildCore/ffmpeg/source/doc/texi2pod.pl -Dconfig-not-all=yes -Idoc /mnt/sda7/ffmpeg_neu/avidemux_2.6/avidemux2/buildCore/ffmpeg/source/doc/libavdevice.texi doc/libavdevice.pod
pod2man --section=1 --center=" " --release=" " doc/ffmpeg-utils.pod > doc/ffmpeg-utils.1
pod2man --section=1 --center=" " --release=" " doc/ffmpeg-scaler.pod > doc/ffmpeg-scaler.1
pod2man --section=1 --center=" " --release=" " doc/ffmpeg-codecs.pod > doc/ffmpeg-codecs.1
pod2man --section=1 --center=" " --release=" " doc/ffmpeg-bitstream-filters.pod > doc/ffmpeg-bitstream-filters.1
pod2man --section=1 --center=" " --release=" " doc/ffmpeg-formats.pod > doc/ffmpeg-formats.1
pod2man --section=1 --center=" " --release=" " doc/ffmpeg-protocols.pod > doc/ffmpeg-protocols.1
pod2man --section=1 --center=" " --release=" " doc/ffmpeg-devices.pod > doc/ffmpeg-devices.1
pod2man --section=3 --center=" " --release=" " doc/libavutil.pod > doc/libavutil.3
pod2man --section=3 --center=" " --release=" " doc/libswscale.pod > doc/libswscale.3
pod2man --section=3 --center=" " --release=" " doc/libavcodec.pod > doc/libavcodec.3
pod2man --section=3 --center=" " --release=" " doc/libavformat.pod > doc/libavformat.3
pod2man --section=3 --center=" " --release=" " doc/libavdevice.pod > doc/libavdevice.3
perl /mnt/sda7/ffmpeg_neu/avidemux_2.6/avidemux2/buildCore/ffmpeg/source/doc/texidep.pl /mnt/sda7/ffmpeg_neu/avidemux_2.6/avidemux2/buildCore/ffmpeg/source /mnt/sda7/ffmpeg_neu/avidemux_2.6/avidemux2/buildCore/ffmpeg/source/doc/fate.texi doc/fate.txt >doc/fate.txt.d
makeinfo --force --no-headers -o doc/fate.txt /mnt/sda7/ffmpeg_neu/avidemux_2.6/avidemux2/buildCore/ffmpeg/source/doc/fate.texi 2>/dev/null
make[3]: Leaving directory '/mnt/Data_bb/sda7/ffmpeg_neu/avidemux_2.6/avidemux2/buildCore/ffmpeg/build'
CMakeFiles/libavcodec.dir/build.make:71: recipe for target 'ffmpeg/build/ffmpeg' failed
make[2]: *** [ffmpeg/build/ffmpeg] Error 1
make[2]: Leaving directory '/mnt/Data_bb/sda7/ffmpeg_neu/avidemux_2.6/avidemux2/buildCore'
CMakeFiles/Makefile2:94: recipe for target 'CMakeFiles/libavcodec.dir/all' failed
make[1]: *** [CMakeFiles/libavcodec.dir/all] Error 2
make[1]: Leaving directory '/mnt/Data_bb/sda7/ffmpeg_neu/avidemux_2.6/avidemux2/buildCore'
Makefile:119: recipe for target 'all' failed
make: *** [all] Error 2
Title: Re: compile errror
Post by: mean on March 21, 2015, 08:19:40 PM
The real error is probably not there
Title: Re: compile errror
Post by: bernd_b on March 21, 2015, 09:28:18 PM
I attached the whole log. Anything else I can provide/ do?
Title: Re: compile errror
Post by: Jan Gruuthuse on March 22, 2015, 06:59:46 AM
@bernd_b
What OS are you building on?
Are you trying to build from a source folder to a build folder?
Are all Requirements there to build according to your hardware/used os
Have you tried your to build in current user home:
cd ~
git clone https://github.com/mean00/avidemux2.git
cd ~/avidemux2 && git pull
cd ~/avidemux2 && bash bootStrap.bash --deb --with-qt4 --without-gtk --with-cli

Title: Re: compile errror
Post by: Jan Gruuthuse on March 22, 2015, 07:24:12 AM
Could you provide a copy of your terminal output, could be more clues in there.

Quote-rw-rw-r-- 1 jan jan 1572728 mrt 22 08:16 avidemux3-cli-2.6.8-150322-Linux.deb
-rw-rw-r-- 1 jan jan 3357434 mrt 22 08:16 avidemux3-core-2.6.8-150322-Linux.deb
-rw-rw-r-- 1 jan jan   73692 mrt 22 08:16 avidemux3-plugins-CLI-2.6.8-150322-Linux.deb
-rw-rw-r-- 1 jan jan 1857480 mrt 22 08:16 avidemux3-plugins-COMMON-2.6.8-150322-Linux.deb
-rw-rw-r-- 1 jan jan  703960 mrt 22 08:16 avidemux3-plugins-QT4-2.6.8-150322-Linux.deb
-rw-rw-r-- 1 jan jan   60212 mrt 22 08:16 avidemux3-plugins-SETTINGS-2.6.8-150322-Linux.deb
-rw-rw-r-- 1 jan jan 2368488 mrt 22 08:16 avidemux3-qt4-2.6.8-150322-Linux.deb
** ALL DONE **
** The installable packages are in the debs folder **

Attached Terminal screen output and current logbuildCore, if needed for comparing.
_____________________________________________
Avidemux v2.6.8 (03aef1d)
_____________________________________________
Compiler: GCC 4.8.2
cmake: 2.8.12.2
Build Target: Linux (x86-64)
User Interface: Qt (4.8.6)
_____________________________________________
Kernel: Linux 3.13.0-46-generic (x86_64) (linux-image-3.13.0-46-generic 3.13.0-46.79)
Distribution: Linux Ubuntu 14.04.2 LTS (Trusty)

Intel Core i7-3770K @ 3.50GHz (4 Cores/8 Threads) with 16 GB ram

Desktop: Unity 7.2.4
Display Server: X Server 1.15.1
Display Driver: nouveau  1.0.11
OpenGL: 2.1.2

OpenGL Vendor: NVIDIA Corporation
OpenGL Renderer: GeForce GT 520/PCIe/SSE2 1024MB (810/535MHz)
OpenGL: 4.2.0 NVIDIA 304.125
Compiler: GCC 4.8 + CUDA 5.5

vdpauinfo:
---------
API version: 1
NVIDIA VDPAU Driver Shared Library  304.125
_____________________________________________
Title: Re: compile errror
Post by: bernd_b on March 22, 2015, 10:34:56 AM
We both have this in our terminal output:
patching file libavcodec/mpegvideo_enc.c
Hunk #1 succeeded at 463 (offset 40 lines).
Hunk #2 succeeded at 562 (offset 40 lines).
Hunk #3 succeeded at 570 (offset 40 lines).
-- -- Mine, Applying patch <libavcodec_put_bits.h.patch> --
patching file libavcodec/put_bits.h
Hunk #1 FAILED at 35.
1 out of 1 hunk FAILED -- saving rejects to file libavcodec/put_bits.h.rej

Although since your are fine with compiling, this may be nothing to worry about.

Here is my output of today's run:
[bernd_b@amd64-archlinux avidemux2]$ git pull
remote: Counting objects: 14, done.
remote: Compressing objects: 100% (14/14), done.
remote: Total 14 (delta 4), reused 0 (delta 0), pack-reused 0
Unpacking objects: 100% (14/14), done.
From https://github.com/mean00/avidemux2
   03aef1d..97b38e3  master     -> origin/master
Updating 03aef1d..97b38e3
Fast-forward
avidemux/winInstaller/avidemux_cross32Qt5.nsi | 20 ++++++++++----------
avidemux/winInstaller/avidemux_cross64Qt5.nsi | 24 ++++++++++++------------
cmake/vf_plugin.cmake                         |  8 ++++----
cmake/vf_plugin_cli.cmake                     | 17 ++++++++---------
cmake/vf_plugin_gtk.cmake                     |  2 +-
cmake/vf_plugin_qt4.cmake                     | 13 +++----------
cmake/vf_plugin_qt4gl.cmake                   |  7 +------
7 files changed, 39 insertions(+), 52 deletions(-)


[bernd_b@amd64-archlinux avidemux2]$ QT_SELECT=4 ./bootStrap.bash --with-cli --with-qt4
CMAKE Version : 3.2.1
Cmake version >=2.8.7 doesnt need fakeroot
Build configuration :
******************* :
Build type :
Release build
    Core will be built
     Gtk will be skipped
    Qt4 will be built
    Cli will be built
    Plugins will be built
**BootStrapping avidemux **
Top dir : /mnt/sda7/ffmpeg_neu/avidemux_2.6/avidemux2
Fake installation directory=/mnt/sda7/ffmpeg_neu/avidemux_2.6/avidemux2/install

** CORE **
Building buildCore from ../avidemux_core with EXTRA=<>, DEBUG=<>
-- The C compiler identification is GNU 4.9.2
-- The CXX compiler identification is GNU 4.9.2
-- Check for working C compiler: /usr/bin/cc
-- Check for working C compiler: /usr/bin/cc -- works
-- Detecting C compiler ABI info
-- Detecting C compiler ABI info - done
-- Detecting C compile features
-- Detecting C compile features - done
-- Check for working CXX compiler: /usr/bin/c++
-- Check for working CXX compiler: /usr/bin/c++ -- works
-- Detecting CXX compiler ABI info
-- Detecting CXX compiler ABI info - done
-- Detecting CXX compile features
-- Detecting CXX compile features - done

#########################################
Configure for avidemux core libs Started
#########################################

-- [BUILD] EXTRA Cflags:
-- [BUILD] EXTRA CXXflags:
-- [BUILD] EXTRA LDflags:
-- [BUILD] Compiler /usr/bin/c++
-- [BUILD] Linker   /usr/bin/ld
-- Top Source dir is /mnt/sda7/ffmpeg_neu/avidemux_2.6/avidemux2/avidemux_core/..

-- Checking Compiler support
-- *************************
-- Checking if compiler supports x86 64-bit - Yes
-- Check if the system is big endian
-- Searching 16 bit integer
-- Looking for sys/types.h
-- Looking for sys/types.h - found
-- Looking for stdint.h
-- Looking for stdint.h - found
-- Looking for stddef.h
-- Looking for stddef.h - found
-- Check size of unsigned short
-- Check size of unsigned short - done
-- Using unsigned short
-- Check if the system is big endian - little endian

-- CMAKE_INSTALL_PREFIX: /usr
-- AVIDEMUX_INSTALL_DIR: /usr
-- FAKEROOT                   : /mnt/sda7/ffmpeg_neu/avidemux_2.6/avidemux2/install/
-- AVIDEMUX_BIN_DIR           : /usr/bin
-- AVIDEMUX_LIB_DIR           : /usr/lib
-- AVIDEMUX_INCLUDE_DIR       : /usr/include
-- AVIDEMUX_SEARCH_INCLUDE_DIR: /mnt/sda7/ffmpeg_neu/avidemux_2.6/avidemux2/install//usr/include
-- AVIDEMUX_SEARCH_LIB_DIR    : /mnt/sda7/ffmpeg_neu/avidemux_2.6/avidemux2/install//usr/lib

-- Checking for SCM
-- ****************
-- Seems to be git or git-svn...
-- Getting git-svn version from /mnt/sda7/ffmpeg_neu/avidemux_2.6/avidemux2/avidemux_core/..
-- <97b38e36b3e><150322>==> 150322_97b38e36b3e

-- Checking for pkg-config
-- ***********************
-- Found PkgConfig: /usr/bin/pkg-config (found version "0.28")
-- Found pkg-config

-- Checking for pthreads
-- *********************
-- Found pthreads

-- Checking for zlib
-- *****************
-- Found ZLIB: /usr/lib64/libz.so (found version "1.2.8")
-- Found zlib

-- Checking for gettext
-- ********************
-- Found libintl.h
-- Cound not find intl library
Could not find Gettext
-- libintl not required for gettext support

-- Checking for SDL
-- ****************
-- Found SDL

-- Checking for XVideo
-- *******************
-- Found X11/extensions/Xvlib.h
-- Found Xv library
-- Found XvShmPutImage in /usr/lib64/libXv.so
-- Found XVideo

-- Checking for execinfo
-- *********************
-- Found execinfo.h
-- Cound not find execinfo library
Could not find execinfo

-- Checking for VDPAU
-- *******************
-- Found vdpau/vdpau.h
-- Found VDPAU

-- Checking for LIBVA
-- *******************
-- Found va/va.h
-- Checking it is the right version...
-- Libva compile check failed
-- Change Dir: /mnt/sda7/ffmpeg_neu/avidemux_2.6/avidemux2/buildCore/CMakeFiles/CMakeTmp

Run Build Command:"/usr/bin/make" "cmTryCompileExec16655894/fast"
/usr/bin/make -f CMakeFiles/cmTryCompileExec16655894.dir/build.make CMakeFiles/cmTryCompileExec16655894.dir/build
make[1]: Entering directory '/mnt/Data_bb/sda7/ffmpeg_neu/avidemux_2.6/avidemux2/buildCore/CMakeFiles/CMakeTmp'
/usr/bin/cmake -E cmake_progress_report /mnt/sda7/ffmpeg_neu/avidemux_2.6/avidemux2/buildCore/CMakeFiles/CMakeTmp/CMakeFiles 1
Building CXX object CMakeFiles/cmTryCompileExec16655894.dir/libva.cpp.o
/usr/bin/c++     -o CMakeFiles/cmTryCompileExec16655894.dir/libva.cpp.o -c /mnt/sda7/ffmpeg_neu/avidemux_2.6/avidemux2/cmake_compile_check/libva.cpp
/mnt/sda7/ffmpeg_neu/avidemux_2.6/avidemux2/cmake_compile_check/libva.cpp: In function ââ,¬Ëœint main(int, char**)ââ,¬â,,¢:
/mnt/sda7/ffmpeg_neu/avidemux_2.6/avidemux2/cmake_compile_check/libva.cpp:11:46: error: invalid conversion from ââ,¬Ëœintââ,¬â,,¢ to ââ,¬ËœVASurfaceID* {aka unsigned int*}ââ,¬â,,¢ [-fpermissive]
         vaCreateSurfaces(dpy,w,h,format,1,&id);
                                              ^
/mnt/sda7/ffmpeg_neu/avidemux_2.6/avidemux2/cmake_compile_check/libva.cpp:11:46: error: invalid conversion from ââ,¬ËœVASurfaceID* {aka unsigned int*}ââ,¬â,,¢ to ââ,¬Ëœunsigned intââ,¬â,,¢ [-fpermissive]
/mnt/sda7/ffmpeg_neu/avidemux_2.6/avidemux2/cmake_compile_check/libva.cpp:11:46: error: too few arguments to function ââ,¬ËœVAStatus vaCreateSurfaces(VADisplay, unsigned int, unsigned int, unsigned int, VASurfaceID*, unsigned int, VASurfaceAttrib*, unsigned int)ââ,¬â,,¢
In file included from /mnt/sda7/ffmpeg_neu/avidemux_2.6/avidemux2/cmake_compile_check/libva.cpp:3:0:
/usr/include/va/va.h:853:1: note: declared here
vaCreateSurfaces(
^
CMakeFiles/cmTryCompileExec16655894.dir/build.make:57: recipe for target 'CMakeFiles/cmTryCompileExec16655894.dir/libva.cpp.o' failed
make[1]: *** [CMakeFiles/cmTryCompileExec16655894.dir/libva.cpp.o] Error 1
make[1]: Leaving directory '/mnt/Data_bb/sda7/ffmpeg_neu/avidemux_2.6/avidemux2/buildCore/CMakeFiles/CMakeTmp'
Makefile:117: recipe for target 'cmTryCompileExec16655894/fast' failed
make: *** [cmTryCompileExec16655894/fast] Error 2

Could not find LIBVA

-- Checking system headers
-- ***********************
-- Looking for gettimeofday
-- Looking for gettimeofday - found
-- Looking for include file inttypes.h
-- Looking for include file inttypes.h - found

-- Checking for ftello
-- ********************
-- ftello present

-- Checking for sqlite
-- *******************
-- Found sqlite3.h
-- Found sqlite3 library
-- Found sqlite3_close in /usr/lib64/libsqlite3.so
-- Found SQLite

-- ADM_coreConfig.h generated

-- Found x265.h
-- Found x265_config.h
-- Creating /mnt/sda7/ffmpeg_neu/avidemux_2.6/avidemux2/buildCore/ffmpeg
-- Checking for tar
-- ****************
-- Found tar

-- Unpacking ffmpeg from /mnt/sda7/ffmpeg_neu/avidemux_2.6/avidemux2/avidemux_core/../avidemux_core/ffmpeg_package/ffmpeg-2.4.3.tar.bz2 to /mnt/sda7/ffmpeg_neu/avidemux_2.6/avidemux2/buildCore/ffmpeg

-- Checking for patch
-- ******************
-- Found patch

-- -- Mine, Applying patch <libavcodec_ac3_h.patch> --
patching file libavcodec/ac3tab.h
Hunk #1 succeeded at 35 (offset 2 lines).
-- -- Mine, Applying patch <libavcodec_avcodec.h.patch> --
patching file libavcodec/avcodec.h
Hunk #1 succeeded at 765 with fuzz 1 (offset 9 lines).
Hunk #2 succeeded at 2298 (offset 49 lines).
Hunk #3 succeeded at 2321 with fuzz 1 (offset 49 lines).
-- -- Mine, Applying patch <libavcodec_ff_spsinfo.h.patch> --
patching file libavcodec/ff_spsinfo.h
-- -- Mine, Applying patch <libavcodec_golomb.h.patch> --
patching file libavcodec/golomb.h
Hunk #1 succeeded at 37 (offset 1 line).
-- -- Mine, Applying patch <libavcodec_h263dec.c.patch> --
patching file libavcodec/h263dec.c
Hunk #1 succeeded at 131 (offset 6 lines).
-- -- Mine, Applying patch <libavcodec_h264_parser.c.patch> --
patching file libavcodec/h264_parser.c
-- -- Mine, Applying patch <libavcodec_libavcodec.v.patch> --
patching file libavcodec/libavcodec.v
-- -- Mine, Applying patch <libavcodec_mathops.h.patch> --
patching file libavcodec/mathops.h
Hunk #1 succeeded at 25 with fuzz 2 (offset 2 lines).
-- -- Mine, Applying patch <libavcodec_mpeg12enc.c.patch> --
patching file libavcodec/mpeg12enc.c
-- -- Mine, Applying patch <libavcodec_mpegvideo_enc.c.patch> --
patching file libavcodec/mpegvideo_enc.c
Hunk #1 succeeded at 463 (offset 40 lines).
Hunk #2 succeeded at 562 (offset 40 lines).
Hunk #3 succeeded at 570 (offset 40 lines).
-- -- Mine, Applying patch <libavcodec_put_bits.h.patch> --
patching file libavcodec/put_bits.h
Hunk #1 FAILED at 35.
1 out of 1 hunk FAILED -- saving rejects to file libavcodec/put_bits.h.rej
-- -- Mine, Applying patch <libavcodec_vdpau.h.patch> --
patching file libavcodec/vdpau.h
-- -- Mine, Applying patch <libavcodec_x86_fmtconvert_init.c.patch> --
patching file libavcodec/x86/fmtconvert_init.c
-- -- Mine, Applying patch <libavformat_isom.c.patch> --
patching file libavformat/isom.c
Hunk #1 succeeded at 276 (offset 11 lines).
-- -- Mine, Applying patch <libavformat_libavformat.v.patch> --
patching file libavformat/libavformat.v
-- -- Mine, Applying patch <libavformat_matroskaenc.c.patch> --
patching file libavformat/matroskaenc.c
-- -- Mine, Applying patch <libavformat_movenc.c.patch> --
patching file libavformat/movenc.c
Hunk #1 succeeded at 875 (offset 35 lines).
-- -- Mine, Applying patch <libavformat_mpegtsenc.c.patch> --
patching file libavformat/mpegtsenc.c
-- -- Mine, Applying patch <libavutil_avutil.h.patch> --
patching file libavutil/avutil.h
Hunk #1 succeeded at 159 with fuzz 1 (offset 52 lines).
-- -- Mine, Applying patch <libavutil_lfg.c.patch> --
patching file libavutil/lfg.c
-- -- Mine, Applying patch <libavutil_lfg.h.patch> --
patching file libavutil/lfg.h
Hunk #1 succeeded at 24 with fuzz 2.
-- Patching Linux common.mak
patching file common.mak
Hunk #1 succeeded at 96 with fuzz 1 (offset 14 lines).

-- Checking for Bourne shell
-- *************************
-- Found Bourne shell

-- Checking for GNU Make
-- *********************
-- Found GNU Make

-- Configuring FFmpeg
-- Configuring done, processing
-- Patching config.mak - linux (2)
patching file config.mak
Hunk #1 succeeded at 102 with fuzz 2 (offset 43 lines).

-- AVFORMAT : 56, Major :
-- AVCODEC  : 56, Major :
-- AVUTIL   : 54, Major :
-- POSTPRC  : 53, Major :
-- SWSCALE  : 3, Major :

-- AVFORMAT : 56, Major :
-- AVCODEC  : 56, Major :
-- AVUTIL   : 54, Major :
-- POSTPRC  : 53, Major :
-- SWSCALE  : 3, Major :

-- Performing Test COMPILER_HAS_HIDDEN_VISIBILITY
-- Performing Test COMPILER_HAS_HIDDEN_VISIBILITY - Success
-- Performing Test COMPILER_HAS_HIDDEN_INLINE_VISIBILITY
-- Performing Test COMPILER_HAS_HIDDEN_INLINE_VISIBILITY - Success
-- Performing Test COMPILER_HAS_DEPRECATED_ATTR
-- Performing Test COMPILER_HAS_DEPRECATED_ATTR - Success

**************************
***  Optional Library  ***
***      Summary       ***
**************************
*** Miscellaneous      ***
    gettext        Yes
    SDL            Yes
    XVideo         Yes
    VDPAU          Yes
    LIBVA          No
**************************
***   Release Build    ***
**************************

-- No packaging... (package=)

-- Configuring done
-- Generating done
CMake Warning:
  Manually-specified variables were not used by the project:

    CMAKE_EDIT_COMMAND


-- Build files have been written to: /mnt/sda7/ffmpeg_neu/avidemux_2.6/avidemux2/buildCore
** Failed at make, result in /tmp/logbuildCore**
Title: Re: compile errror
Post by: Jan Gruuthuse on March 22, 2015, 11:23:26 AM
The 1st error appearing: libva is disabled by mean

I See difference in ***   Release Build    ***:
"-- No packaging... (package=)"
vs
"-- Packager=deb, valid choices= {deb,rpm,tgz,none}"

Perhaps mean has a better insight into why.
Title: Re: compile errror
Post by: bernd_b on March 22, 2015, 11:48:35 AM
This difference is by purpose,  I do not want to build a deb-package.
But I tried your build command as well and failed the same way.
Title: Re: compile errror
Post by: sl1pkn07 on March 22, 2015, 01:29:57 PM
@Jan Gruuthuse

linux != ubuntu

greetings
Title: Re: compile errror
Post by: sl1pkn07 on March 22, 2015, 01:32:11 PM


you have the same error like me (according of you logbuildcore log posted in here http://avidemux.org/smuf/index.php?action=post;quote=72127;topic=16379.0;last_msg=72131{)

http://avidemux.org/smuf/index.php/topic,16377.0.html{
Title: Re: compile errror
Post by: mean on March 22, 2015, 01:41:46 PM
makeinfo --force --no-headers -o doc/fate.txt /mnt/sda7/ffmpeg_neu/avidemux_2.6/avidemux2/buildCore/ffmpeg/source/doc/fate.texi 2 || echo "FAILED"

Does it print failed ?
Title: Re: compile errror
Post by: sl1pkn07 on March 22, 2015, 04:38:29 PM

â”Å'â”â,¬Ã¢â€Â¤[$]|[sl1pkn07]|[sL1pKn07]|[~/aplicaciones/avidemux-git]|
â””â”â,¬Ã¢â€â,¬Ã¢â€â,¬Ã¢â€¢Â¼  locate fate.texi |grep avidemux
/home/sl1pkn07/aplicaciones/avidemux-git/src/build_core/ffmpeg/source/doc/fate.texi
â”Å'â”â,¬Ã¢â€Â¤[$]|[sl1pkn07]|[sL1pKn07]|[~/aplicaciones/avidemux-git]|
â””â”â,¬Ã¢â€â,¬Ã¢â€â,¬Ã¢â€¢Â¼  ls /home/sl1pkn07/aplicaciones/avidemux-git/src/build_core/ffmpeg/source/doc/fate.texi
-rw-r--r-- 1 sl1pkn07 users 6747 nov  1 13:52 /home/sl1pkn07/aplicaciones/avidemux-git/src/build_core/ffmpeg/source/doc/fate.texi
â”Å'â”â,¬Ã¢â€Â¤[$]|[sl1pkn07]|[sL1pKn07]|[~/aplicaciones/avidemux-git]|
â””â”â,¬Ã¢â€â,¬Ã¢â€â,¬Ã¢â€¢Â¼  LANG=C makeinfo --force --no-headers -o doc/fate.txt /home/sl1pkn07/aplicaciones/avidemux-git/src/build_core/ffmpeg/source/doc/fate.texi 2 || echo "FAILED"
makeinfo: could not open doc/fate.txt for writing: No such file or directory
could not open 2: No such file or directory



â””â”â,¬Ã¢â€â,¬Ã¢â€â,¬Ã¢â€¢Â¼  LANG=C yaourt -Qo makeinfo
/usr/bin/makeinfo is owned by texinfo 5.2-3


if create the 'doc' folder by hand:

â”Å'â”â,¬Ã¢â€Â¤[$]|[sl1pkn07]|[sL1pKn07]|[~/aplicaciones/avidemux-git]|
â””â”â,¬Ã¢â€â,¬Ã¢â€â,¬Ã¢â€¢Â¼  mkdir -p doc
â”Å'â”â,¬Ã¢â€Â¤[$]|[sl1pkn07]|[sL1pKn07]|[~/aplicaciones/avidemux-git]|
â””â”â,¬Ã¢â€â,¬Ã¢â€â,¬Ã¢â€¢Â¼  LANG=C makeinfo --force --no-headers -o doc/fate.txt /home/sl1pkn07/aplicaciones/avidemux-git/src/build_core/ffmpeg/source/doc/fate.texi 2 || echo "FAILED"
could not open 2: No such file or directory
Title: Re: compile errror
Post by: bernd_b on March 22, 2015, 07:22:08 PM
I fear I have nothing to add so far:
makeinfo --force --no-headers -o doc/fate.txt /mnt/sda7/ffmpeg_neu/avidemux_2.6/avidemux2/buildCore/ffmpeg/source/doc/fate.texi 2 || echo "FAILED"
makeinfo: could not open doc/fate.txt for writing: No such file or directory
could not open 2: No such file or directory


O.K, another try:
changing to /mnt/sda7/ffmpeg_neu/avidemux_2.6/avidemux2/buildCore/ffmpeg/source
Now running:
makeinfo --force --no-headers -o doc/fate.txt /mnt/sda7/ffmpeg_neu/avidemux_2.6/avidemux2/buildCore/ffmpeg/source/doc/fate.texi || echo "FAILED"
So I left out the "2" before the "||.
The command runs without any messages and produces the file -o doc/fate.txt as supposed (I guess as supposed)
Title: Re: compile errror
Post by: mean on March 23, 2015, 05:50:06 AM
The 2: it was a bad copy/paste
So it is ok, no idea why is it failing, everything looks good
Title: Re: compile errror
Post by: Jan Gruuthuse on March 23, 2015, 06:24:14 AM
Logbuildcore around line 627 (ffmpeg plenty warnings, not hapenening in my build)

Perhaps:
OS 64-bit vs 32-bit
echo "Bit: "$(getconf LONG_BIT)
Or
Operating System localisation Default English versus Spanish & German (difference in some notation: decimal point vs decimal comma, ....)
Testing something not getting an expected reply due to this localisation?
Title: Re: compile errror
Post by: sl1pkn07 on March 23, 2015, 03:11:52 PM

CMakeFiles/libavcodec.dir/build.make:71: recipe for target 'ffmpeg/build/ffmpeg' failed
make[2]: *** [ffmpeg/build/ffmpeg] Error 1


in CMakeFiles/libavcodec.dir/build.make line 71:


ffmpeg/build/ffmpeg: ffmpeg/build/libavcodec/libADM6avcodec.so.56
@$(CMAKE_COMMAND) -E touch_nocreate ffmpeg/build/ffmpeg



â””â”â,¬Ã¢â€â,¬Ã¢â€â,¬Ã¢â€¢Â¼  LANG=C ls ffmpeg/build/ffmpeg
ls: cannot access ffmpeg/build/ffmpeg: No such file or directory


maybe bad rule to make ffmpeg? (make autogenerated?)


one question. in my kwedge, avidemux only need the libavfoo libraries, rigth, then why not change

--disable-ffplay --disable-ffprobe

in avidemux/cmake/admFFmpegBuild.cmake to

--disable-programs

? (to build only the libraries)

also no need generate a ffmpeg documentation(?), then why not add '--disable-doc' in a ffmpeg options?

greetings
Title: Re: compile errror
Post by: mean on March 23, 2015, 06:02:11 PM
I'll push the updated ffmpeg soon, including your hints
It might help
Title: Re: compile errror
Post by: bernd_b on March 23, 2015, 07:06:33 PM
So far nothing new I fear
git pull
Updating ee7b929..6424f73
Fast-forward
avidemux_core/ffmpeg_package/ffmpeg-2.4.3.tar.bz2                           | Bin 7369986 -> 0 bytes
avidemux_core/ffmpeg_package/ffmpeg-2.6.1.tar.bz2                           | Bin 0 -> 7802246 bytes
avidemux_core/ffmpeg_package/patches/libavcodec_put_bits.h.patch            |  12 ------------
avidemux_core/ffmpeg_package/patches/libavcodec_x86_fmtconvert_init.c.patch |  17 -----------------
avidemux_core/ffmpeg_package/patches/libavformat_matroskaenc.c.patch        |  47 ++++++++++++++++++++++++-----------------------
cmake/admFFmpegBuild.cmake                                                  |   6 +++---
6 files changed, 27 insertions(+), 55 deletions(-)
delete mode 100644 avidemux_core/ffmpeg_package/ffmpeg-2.4.3.tar.bz2
create mode 100644 avidemux_core/ffmpeg_package/ffmpeg-2.6.1.tar.bz2
delete mode 100644 avidemux_core/ffmpeg_package/patches/libavcodec_put_bits.h.patch
delete mode 100644 avidemux_core/ffmpeg_package/patches/libavcodec_x86_fmtconvert_init.c.patch
[bernd_b@amd64-archlinux avidemux2]$ bash bootStrap.sh --with-qt4 --with-cli
bash: bootStrap.sh: No such file or directory
[bernd_b@amd64-archlinux avidemux2]$ bash bootStrap.sh --with-qt4 --with-cli
bootStrap.bash                 bootStrapCrossMingw_w32Qt5.sh  bootStrapCrossMingw_w64.sh     
bootStrapCrossMac106.sh        bootStrapCrossMingw_w32.sh     bootStrapHaikuOS.bash         
bootStrapCrossMingw.sh         bootStrapCrossMingw_w64Qt5.sh  bootStrapOsx.bash             
[bernd_b@amd64-archlinux avidemux2]$ bash bootStrap.bash --with-qt4 --with-cli
CMAKE Version : 3.2.1
Cmake version >=2.8.7 doesnt need fakeroot
Build configuration :
******************* :
Build type :
Release build
    Core will be built
     Gtk will be skipped
    Qt4 will be built
    Cli will be built
    Plugins will be built
**BootStrapping avidemux **
Top dir : /mnt/sda7/ffmpeg_neu/avidemux_2.6/avidemux2
Fake installation directory=/mnt/sda7/ffmpeg_neu/avidemux_2.6/avidemux2/install

** CORE **
Building buildCore from ../avidemux_core with EXTRA=<>, DEBUG=<>
-- The C compiler identification is GNU 4.9.2
-- The CXX compiler identification is GNU 4.9.2
-- Check for working C compiler: /usr/bin/cc
-- Check for working C compiler: /usr/bin/cc -- works
-- Detecting C compiler ABI info
-- Detecting C compiler ABI info - done
-- Detecting C compile features
-- Detecting C compile features - done
-- Check for working CXX compiler: /usr/bin/c++
-- Check for working CXX compiler: /usr/bin/c++ -- works
-- Detecting CXX compiler ABI info
-- Detecting CXX compiler ABI info - done
-- Detecting CXX compile features
-- Detecting CXX compile features - done

#########################################
Configure for avidemux core libs Started
#########################################

-- [BUILD] EXTRA Cflags:
-- [BUILD] EXTRA CXXflags:
-- [BUILD] EXTRA LDflags:
-- [BUILD] Compiler /usr/bin/c++
-- [BUILD] Linker   /usr/bin/ld
-- Top Source dir is /mnt/sda7/ffmpeg_neu/avidemux_2.6/avidemux2/avidemux_core/..

-- Checking Compiler support
-- *************************
-- Checking if compiler supports x86 64-bit - Yes
-- Check if the system is big endian
-- Searching 16 bit integer
-- Looking for sys/types.h
-- Looking for sys/types.h - found
-- Looking for stdint.h
-- Looking for stdint.h - found
-- Looking for stddef.h
-- Looking for stddef.h - found
-- Check size of unsigned short
-- Check size of unsigned short - done
-- Using unsigned short
-- Check if the system is big endian - little endian

-- CMAKE_INSTALL_PREFIX: /usr
-- AVIDEMUX_INSTALL_DIR: /usr
-- FAKEROOT                   : /mnt/sda7/ffmpeg_neu/avidemux_2.6/avidemux2/install/
-- AVIDEMUX_BIN_DIR           : /usr/bin
-- AVIDEMUX_LIB_DIR           : /usr/lib
-- AVIDEMUX_INCLUDE_DIR       : /usr/include
-- AVIDEMUX_SEARCH_INCLUDE_DIR: /mnt/sda7/ffmpeg_neu/avidemux_2.6/avidemux2/install//usr/include
-- AVIDEMUX_SEARCH_LIB_DIR    : /mnt/sda7/ffmpeg_neu/avidemux_2.6/avidemux2/install//usr/lib

-- Checking for SCM
-- ****************
-- Seems to be git or git-svn...
-- Getting git-svn version from /mnt/sda7/ffmpeg_neu/avidemux_2.6/avidemux2/avidemux_core/..
-- <6424f733886><150323>==> 150323_6424f733886

-- Checking for pkg-config
-- ***********************
-- Found PkgConfig: /usr/bin/pkg-config (found version "0.28")
-- Found pkg-config

-- Checking for pthreads
-- *********************
-- Found pthreads

-- Checking for zlib
-- *****************
-- Found ZLIB: /usr/lib64/libz.so (found version "1.2.8")
-- Found zlib

-- Checking for gettext
-- ********************
-- Found libintl.h
-- Cound not find intl library
Could not find Gettext
-- libintl not required for gettext support

-- Checking for SDL
-- ****************
-- Found SDL

-- Checking for XVideo
-- *******************
-- Found X11/extensions/Xvlib.h
-- Found Xv library
-- Found XvShmPutImage in /usr/lib64/libXv.so
-- Found XVideo

-- Checking for execinfo
-- *********************
-- Found execinfo.h
-- Cound not find execinfo library
Could not find execinfo

-- Checking for VDPAU
-- *******************
-- Found vdpau/vdpau.h
-- Found VDPAU

-- Checking for LIBVA
-- *******************
-- Found va/va.h
-- Checking it is the right version...
-- Libva compile check failed
-- Change Dir: /mnt/sda7/ffmpeg_neu/avidemux_2.6/avidemux2/buildCore/CMakeFiles/CMakeTmp

Run Build Command:"/usr/bin/make" "cmTryCompileExec2798023966/fast"
/usr/bin/make -f CMakeFiles/cmTryCompileExec2798023966.dir/build.make CMakeFiles/cmTryCompileExec2798023966.dir/build
make[1]: Entering directory '/mnt/Data_bb/sda7/ffmpeg_neu/avidemux_2.6/avidemux2/buildCore/CMakeFiles/CMakeTmp'
/usr/bin/cmake -E cmake_progress_report /mnt/sda7/ffmpeg_neu/avidemux_2.6/avidemux2/buildCore/CMakeFiles/CMakeTmp/CMakeFiles 1
Building CXX object CMakeFiles/cmTryCompileExec2798023966.dir/libva.cpp.o
/usr/bin/c++     -o CMakeFiles/cmTryCompileExec2798023966.dir/libva.cpp.o -c /mnt/sda7/ffmpeg_neu/avidemux_2.6/avidemux2/cmake_compile_check/libva.cpp
/mnt/sda7/ffmpeg_neu/avidemux_2.6/avidemux2/cmake_compile_check/libva.cpp: In function ââ,¬Ëœint main(int, char**)ââ,¬â,,¢:
/mnt/sda7/ffmpeg_neu/avidemux_2.6/avidemux2/cmake_compile_check/libva.cpp:11:46: error: invalid conversion from ââ,¬Ëœintââ,¬â,,¢ to ââ,¬ËœVASurfaceID* {aka unsigned int*}ââ,¬â,,¢ [-fpermissive]
         vaCreateSurfaces(dpy,w,h,format,1,&id);
                                              ^
/mnt/sda7/ffmpeg_neu/avidemux_2.6/avidemux2/cmake_compile_check/libva.cpp:11:46: error: invalid conversion from ââ,¬ËœVASurfaceID* {aka unsigned int*}ââ,¬â,,¢ to ââ,¬Ëœunsigned intââ,¬â,,¢ [-fpermissive]
/mnt/sda7/ffmpeg_neu/avidemux_2.6/avidemux2/cmake_compile_check/libva.cpp:11:46: error: too few arguments to function ââ,¬ËœVAStatus vaCreateSurfaces(VADisplay, unsigned int, unsigned int, unsigned int, VASurfaceID*, unsigned int, VASurfaceAttrib*, unsigned int)ââ,¬â,,¢
In file included from /mnt/sda7/ffmpeg_neu/avidemux_2.6/avidemux2/cmake_compile_check/libva.cpp:3:0:
/usr/include/va/va.h:853:1: note: declared here
vaCreateSurfaces(
^
CMakeFiles/cmTryCompileExec2798023966.dir/build.make:57: recipe for target 'CMakeFiles/cmTryCompileExec2798023966.dir/libva.cpp.o' failed
make[1]: *** [CMakeFiles/cmTryCompileExec2798023966.dir/libva.cpp.o] Error 1
make[1]: Leaving directory '/mnt/Data_bb/sda7/ffmpeg_neu/avidemux_2.6/avidemux2/buildCore/CMakeFiles/CMakeTmp'
Makefile:117: recipe for target 'cmTryCompileExec2798023966/fast' failed
make: *** [cmTryCompileExec2798023966/fast] Error 2

Could not find LIBVA

-- Checking system headers
-- ***********************
-- Looking for gettimeofday
-- Looking for gettimeofday - found
-- Looking for include file inttypes.h
-- Looking for include file inttypes.h - found

-- Checking for ftello
-- ********************
-- ftello present

-- Checking for sqlite
-- *******************
-- Found sqlite3.h
-- Found sqlite3 library
-- Found sqlite3_close in /usr/lib64/libsqlite3.so
-- Found SQLite

-- ADM_coreConfig.h generated

-- Found x265.h
-- Found x265_config.h
-- Creating /mnt/sda7/ffmpeg_neu/avidemux_2.6/avidemux2/buildCore/ffmpeg
-- Checking for tar
-- ****************
-- Found tar

-- Unpacking ffmpeg from /mnt/sda7/ffmpeg_neu/avidemux_2.6/avidemux2/avidemux_core/../avidemux_core/ffmpeg_package/ffmpeg-2.6.1.tar.bz2 to /mnt/sda7/ffmpeg_neu/avidemux_2.6/avidemux2/buildCore/ffmpeg

-- Checking for patch
-- ******************
-- Found patch

-- -- Mine, Applying patch <libavcodec_ac3_h.patch> --
patching file libavcodec/ac3tab.h
Hunk #1 succeeded at 35 (offset 2 lines).
-- -- Mine, Applying patch <libavcodec_avcodec.h.patch> --
patching file libavcodec/avcodec.h
Hunk #1 succeeded at 766 with fuzz 1 (offset 10 lines).
Hunk #2 succeeded at 2304 (offset 55 lines).
Hunk #3 succeeded at 2328 with fuzz 1 (offset 56 lines).
-- -- Mine, Applying patch <libavcodec_ff_spsinfo.h.patch> --
patching file libavcodec/ff_spsinfo.h
-- -- Mine, Applying patch <libavcodec_golomb.h.patch> --
patching file libavcodec/golomb.h
Hunk #1 succeeded at 37 (offset 1 line).
-- -- Mine, Applying patch <libavcodec_h263dec.c.patch> --
patching file libavcodec/h263dec.c
Hunk #1 succeeded at 137 (offset 12 lines).
-- -- Mine, Applying patch <libavcodec_h264_parser.c.patch> --
patching file libavcodec/h264_parser.c
Hunk #1 succeeded at 40 with fuzz 2 (offset 6 lines).
-- -- Mine, Applying patch <libavcodec_libavcodec.v.patch> --
patching file libavcodec/libavcodec.v
-- -- Mine, Applying patch <libavcodec_mathops.h.patch> --
patching file libavcodec/mathops.h
Hunk #1 succeeded at 25 with fuzz 2 (offset 2 lines).
-- -- Mine, Applying patch <libavcodec_mpeg12enc.c.patch> --
patching file libavcodec/mpeg12enc.c
-- -- Mine, Applying patch <libavcodec_mpegvideo_enc.c.patch> --
patching file libavcodec/mpegvideo_enc.c
Hunk #1 succeeded at 469 (offset 46 lines).
Hunk #2 succeeded at 568 (offset 46 lines).
Hunk #3 succeeded at 576 (offset 46 lines).
-- -- Mine, Applying patch <libavcodec_vdpau.h.patch> --
patching file libavcodec/vdpau.h
Hunk #1 succeeded at 231 (offset 40 lines).
-- -- Mine, Applying patch <libavformat_isom.c.patch> --
patching file libavformat/isom.c
Hunk #1 succeeded at 280 (offset 15 lines).
-- -- Mine, Applying patch <libavformat_libavformat.v.patch> --
patching file libavformat/libavformat.v
-- -- Mine, Applying patch <libavformat_movenc.c.patch> --
patching file libavformat/movenc.c
Hunk #1 succeeded at 1126 with fuzz 2 (offset 286 lines).
-- -- Mine, Applying patch <libavformat_mpegtsenc.c.patch> --
patching file libavformat/mpegtsenc.c
Hunk #1 succeeded at 1208 with fuzz 2 (offset 13 lines).
-- -- Mine, Applying patch <libavutil_avutil.h.patch> --
patching file libavutil/avutil.h
Hunk #1 succeeded at 159 with fuzz 1 (offset 52 lines).
-- -- Mine, Applying patch <libavutil_lfg.c.patch> --
patching file libavutil/lfg.c
-- -- Mine, Applying patch <libavutil_lfg.h.patch> --
patching file libavutil/lfg.h
Hunk #1 succeeded at 24 with fuzz 2.
-- -- Mine, Applying patch <libavformat_matroskaenc.c.patch> --
patching file libavformat/matroskaenc.c
-- Patching Linux common.mak
patching file common.mak
Hunk #1 succeeded at 104 with fuzz 1 (offset 22 lines).

-- Checking for Bourne shell
-- *************************
-- Found Bourne shell

-- Checking for GNU Make
-- *********************
-- Found GNU Make

-- Configuring FFmpeg
-- Configuring done, processing
-- Patching config.mak - linux (2)
patching file config.mak
Hunk #1 succeeded at 102 with fuzz 2 (offset 43 lines).

-- AVFORMAT : 56, Major :
-- AVCODEC  : 56, Major :
-- AVUTIL   : 54, Major :
-- POSTPRC  : 53, Major :
-- SWSCALE  : 3, Major :

-- AVFORMAT : 56, Major :
-- AVCODEC  : 56, Major :
-- AVUTIL   : 54, Major :
-- POSTPRC  : 53, Major :
-- SWSCALE  : 3, Major :

-- Performing Test COMPILER_HAS_HIDDEN_VISIBILITY
-- Performing Test COMPILER_HAS_HIDDEN_VISIBILITY - Success
-- Performing Test COMPILER_HAS_HIDDEN_INLINE_VISIBILITY
-- Performing Test COMPILER_HAS_HIDDEN_INLINE_VISIBILITY - Success
-- Performing Test COMPILER_HAS_DEPRECATED_ATTR
-- Performing Test COMPILER_HAS_DEPRECATED_ATTR - Success

**************************
***  Optional Library  ***
***      Summary       ***
**************************
*** Miscellaneous      ***
    gettext        Yes
    SDL            Yes
    XVideo         Yes
    VDPAU          Yes
    LIBVA          No
**************************
***   Release Build    ***
**************************

-- No packaging... (package=)

-- Configuring done
-- Generating done
CMake Warning:
  Manually-specified variables were not used by the project:

    CMAKE_EDIT_COMMAND


-- Build files have been written to: /mnt/sda7/ffmpeg_neu/avidemux_2.6/avidemux2/buildCore
** Failed at make, result in /tmp/logbuildCore**


Title: Re: compile errror
Post by: Jan Gruuthuse on March 23, 2015, 07:18:06 PM
Ubuntu 14.04.2 LTS amd64: build was OK. attached logbuildCore
Title: Re: compile errror
Post by: Jan Gruuthuse on March 23, 2015, 07:40:05 PM
looks both similar except in yours: line 1010 (diffuse merge tool against both logbuildCore)
In file included from /usr/include/inttypes.h:25:0,
                 from /mnt/sda7/ffmpeg_neu/avidemux_2.6/avidemux2/buildCore/ffmpeg/source/libswscale/utils.c:25:
/usr/include/features.h:148:3: warning: #warning "_BSD_SOURCE and _SVID_SOURCE are deprecated, use _DEFAULT_SOURCE" [-Wcpp]
# warning "_BSD_SOURCE and _SVID_SOURCE are deprecated, use _DEFAULT_SOURCE"
   ^
/usr/bin/cc -I. -I/mnt/sda7/ffmpeg_neu/avidemux_2.6/avidemux2/buildCore/ffmpeg/source/ -D_ISOC99_SOURCE -D_FILE_OFFSET_BITS=64 -D_LARGEFILE_SOURCE -D_POSIX_C_SOURCE=200112 -D_XOPEN_SOURCE=600 -DPIC -DZLIB_CONST -DHAVE_AV_CONFIG_H -fmessage-length=0 -std=c99 -fomit-frame-pointer -fPIC -pthread -D_GNU_SOURCE=1 -D_REENTRANT -I/usr/include/SDL  -Wdeclaration-after-statement -Wall -Wdisabled-optimization -Wpointer-arith -Wredundant-decls -Wwrite-strings -Wtype-limits -Wundef -Wmissing-prototypes -Wno-pointer-to-int-cast -Wstrict-prototypes -Wempty-body -Wno-parentheses -Wno-switch -Wno-format-zero-length -Wno-pointer-sign -O3 -fno-math-errno -fno-signed-zeros -fno-tree-vectorize -Werror=format-security -Werror=implicit-function-declaration -Werror=missing-prototypes -Werror=return-type -Werror=vla -Wformat -Wno-maybe-uninitialized  -MMD -MF libswscale/x86/hscale_fast_bilinear_simd.d -MT libswscale/x86/hscale_fast_bilinear_simd.o -c -o libswscale/x86/hscale_fast_bilinear_simd.o /mnt/sda7/ffmpeg_neu/avidemux_2.6/avidemux2/buildCore/ffmpeg/source/libswscale/x86/hscale_fast_bilinear_simd.c
Title: Re: compile errror
Post by: sl1pkn07 on March 23, 2015, 08:34:29 PM
thanks for the latest commit. unfortunately still break the build in the same point :S

but i found a solution for my problem:

remove this line

https://github.com/mean00/avidemux2/blob/6424f733886200c6592f24dd0111640aa65cae6b/cmake/admFFmpegBuild.cmake#L298

if remove, all build OK with zero problems, include Qt4 and CLI (with respective plugins)

i not sure why. but it works!

any can test this?

EDIT: boh, the multithread build still fail in build ffmpeg step. build upstream sources works ok always

greetings
Title: Re: compile errror
Post by: mean on March 23, 2015, 08:57:29 PM
we dont build the exe any longer but mark them as target, i overtlooked that one
Title: Re: compile errror
Post by: bernd_b on March 23, 2015, 10:36:25 PM
Deleting the line mentioned by sl1pkn07 made the compile process run to the end.

Although, in between, I found these error messages:

-- Checking for FAAD
-- *****************
-- Found faad.h
-- Found faad library
-- Could not find faacDecInit in /usr/lib64/libfaad.so
-- Change Dir: /mnt/sda7/ffmpeg_neu/avidemux_2.6/avidemux2/buildPluginsCommon/CMakeFiles/CMakeTmp

Run Build Command:"/usr/bin/make" "cmTryCompileExec3099560844/fast"
/usr/bin/make -f CMakeFiles/cmTryCompileExec3099560844.dir/build.make CMakeFiles/cmTryCompileExec3099560844.dir/build
make[1]: Entering directory '/mnt/Data_bb/sda7/ffmpeg_neu/avidemux_2.6/avidemux2/buildPluginsCommon/CMakeFiles/CMakeTmp'
/usr/bin/cmake -E cmake_progress_report /mnt/sda7/ffmpeg_neu/avidemux_2.6/avidemux2/buildPluginsCommon/CMakeFiles/CMakeTmp/CMakeFiles 1
Building C object CMakeFiles/cmTryCompileExec3099560844.dir/CheckFunctionExists.c.o
/usr/bin/cc  -DCHECK_FUNCTION_EXISTS=faacDecInit -fmessage-length=0 -fmessage-length=0    -o CMakeFiles/cmTryCompileExec3099560844.dir/CheckFunctionExists.c.o   -c /mnt/sda7/ffmpeg_neu/avidemux_2.6/avidemux2/cmake_compile_check/CheckFunctionExists.c
Linking C executable cmTryCompileExec3099560844
/usr/bin/cmake -E cmake_link_script CMakeFiles/cmTryCompileExec3099560844.dir/link.txt --verbose=1
/usr/bin/cc   -fmessage-length=0 -fmessage-length=0     CMakeFiles/cmTryCompileExec3099560844.dir/CheckFunctionExists.c.o  -o cmTryCompileExec3099560844 -rdynamic -lfaad
CMakeFiles/cmTryCompileExec3099560844.dir/CheckFunctionExists.c.o: In function `main':
CheckFunctionExists.c:(.text+0x15): undefined reference to `faacDecInit'
collect2: error: ld returned 1 exit status
CMakeFiles/cmTryCompileExec3099560844.dir/build.make:89: recipe for target 'cmTryCompileExec3099560844' failed
make[1]: *** [cmTryCompileExec3099560844] Error 1
make[1]: Leaving directory '/mnt/Data_bb/sda7/ffmpeg_neu/avidemux_2.6/avidemux2/buildPluginsCommon/CMakeFiles/CMakeTmp'
Makefile:117: recipe for target 'cmTryCompileExec3099560844/fast' failed
make: *** [cmTryCompileExec3099560844/fast] Error 2

-- Found NeAACDecInit in /usr/lib64/libfaad.so


But obviously this doesn't prevent the program to be build. The installed version introduces itself as "Avidemux v2.6.8 (150323_6424f733886)".