Author Topic: Fixed: 91847be ** Failed at make, result in /tmp/logbuildCli**  (Read 681 times)

Jan Gruuthuse

  • Hero Member
  • *****
  • Posts: 6060
Fixed by: 27f2cbf

Ubuntu 16.04 LTS 64-bit
ends with:

Code: [Select]
In file included from /home/jan/avidemux2/avidemux/common/ADM_editor/src/ADM_edRender.cpp:21:0:
/home/jan/avidemux2/avidemux/cli/../common/ADM_editor/include/ADM_edit.hxx:262:49: warning: non-static data member initializers only available with -std=c++11 or -std=gnu++11
                     uint64_t    totalExtraDelay=0;
                                                 ^
/home/jan/avidemux2/avidemux/cli/../common/ADM_editor/include/ADM_edit.hxx:263:45: warning: non-static data member initializers only available with -std=c++11 or -std=gnu++11
                     int64_t     desyncScore=0;
                                             ^
common/ADM_toolkit/CMakeFiles/ADM_toolkit6.dir/build.make:113: recipe for target 'common/ADM_toolkit/CMakeFiles/ADM_toolkit6.dir/automation.cpp.o' failed
make[2]: *** [common/ADM_toolkit/CMakeFiles/ADM_toolkit6.dir/automation.cpp.o] Error 1
make[2]: Leaving directory '/home/jan/avidemux2/buildCli'
CMakeFiles/Makefile2:744: recipe for target 'common/ADM_toolkit/CMakeFiles/ADM_toolkit6.dir/all' failed
make[1]: *** [common/ADM_toolkit/CMakeFiles/ADM_toolkit6.dir/all] Error 2
make[1]: *** Waiting for unfinished jobs....
« Last Edit: April 02, 2018, 05:17:37 AM by Jan Gruuthuse »

eumagga0x2a

  • Moderator
  • Hero Member
  • *****
  • Posts: 3066
Re: 91847be ** Failed at make, result in /tmp/logbuildCli**
« Reply #1 on: March 27, 2018, 01:28:39 PM »
Quote
Code: [Select]
ADM_toolkit/automation.cpp: In function ‘void call_scriptEngine(const char*)’:
/home/jan/avidemux2/avidemux/common/ADM_toolkit/automation.cpp:224:12: error: ‘errno’ was not declared in this scope
         if(errno == EACCES)
            ^
/home/jan/avidemux2/avidemux/common/ADM_toolkit/automation.cpp:224:21: error: ‘EACCES’ was not declared in this scope
         if(errno == EACCES)
                     ^
/home/jan/avidemux2/avidemux/common/ADM_toolkit/automation.cpp:228:12: error: ‘errno’ was not declared in this scope
         if(errno == ENOENT)
            ^
/home/jan/avidemux2/avidemux/common/ADM_toolkit/automation.cpp:228:21: error: ‘ENOENT’ was not declared in this scope
         if(errno == ENOENT)
                     ^

Thanks, will investigate, which include is missing (and why the build succeeded on my Fedora system).

eumagga0x2a

  • Moderator
  • Hero Member
  • *****
  • Posts: 3066

Jan Gruuthuse

  • Hero Member
  • *****
  • Posts: 6060
Fixed: 91847be ** Failed at make, result in /tmp/logbuildCli**
« Reply #3 on: March 28, 2018, 05:48:45 AM »
Confirmed: 27f2cbf did build as usual, thnx.
Code: [Select]
** ALL DONE **
** The installable packages are in the debs folder **